rpm for imspector 0.9 available

on

I packaged imspector 0.9 for fedora 12 x86_64

IMSpector is an Instant Messenger proxy and it supports MSN, Jabber/XMPP, AIM, ICQ, Yahoo, IRC and Gadu-Gadu.

The package is available in the inuits rpm repository

11 thoughts on “rpm for imspector 0.9 available

  1. Hi, I’m looking for the rpm file in the repository and not against. What is the url to download?
    Thanks

          1. Sorry I don’t have it here, but I could post the src.rpm you could use it to build your i386 version.

          2. Hi,

            It’s listed above, I don’t have the one for centos, this one is for fedora, maybe you need to review the .spec file 🙂

            Enjoy.

          3. Hi , could you send me the spec to my email? or can I download it of your site?

            regardss

          4. Hi,

            Sorry, I updated it but I forgot to list it… here it is (you can find it above after the post)

            cheers,

          5. Regards , I tried to make rpm from src.rpm but fail

            check

            g++ -Wall -O2 -fPIC -I/usr/include -DHAVE_SSL main.cpp -c
            g++ -Wall -O2 -fPIC -I/usr/include -DHAVE_SSL protocolplugin.cpp -c
            g++ -Wall -O2 -fPIC -I/usr/include -DHAVE_SSL loggingplugin.cpp -c
            g++ -Wall -O2 -fPIC -I/usr/include -DHAVE_SSL filterplugin.cpp -c
            g++ -Wall -O2 -fPIC -I/usr/include -DHAVE_SSL responderplugin.cpp -c
            g++ -Wall -O2 -fPIC -I/usr/include -DHAVE_SSL sslstate.cpp -c
            sslstate.cpp: In member function ‘bool SSLState::init(Options&, bool)’:
            sslstate.cpp:39: error: invalid conversion from ‘const SSL_METHOD*’ to ‘SSL_METHOD*’
            sslstate.cpp:39: error: initializing argument 1 of ‘SSL_CTX* SSL_CTX_new(SSL_METHOD*)’
            sslstate.cpp:40: error: invalid conversion from ‘const SSL_METHOD*’ to ‘SSL_METHOD*’
            sslstate.cpp:40: error: initializing argument 1 of ‘SSL_CTX* SSL_CTX_new(SSL_METHOD*)’
            make: *** [sslstate.o] Error 1
            error: Bad exit status from /var/tmp/rpm-tmp.99611 (%build)

            the error is a both src.rpm and spec.file

            any idea?

            regardss

Leave a Reply

Your email address will not be published. Required fields are marked *

This site uses Akismet to reduce spam. Learn how your comment data is processed.

recent

Last Tweets

  • Next week at ,
  • No Ping Will Tear Us Apart – Enabling member auto-rejoin in Group Replication !,
  • RT : 「三谷 さんのセッション、すべて良かったんですが特に良かったのが、 MySQL InnoDB ClusterのConsistency Levelのまとめ 」 「この辺は地雷キュアことyoku0825さんか運用キュアの三谷さんにおススメパターンを導いてほしい!(お前がやれ)」w  ,
  • RT : 【フォトスポット📸まとめ】 会場 フォトスポットにて撮影、投稿いただいた皆さんありがとうございました🙌 (投稿いただいた画像を使用させていただきました🙇‍♀️) 次回は今回よりも! 皆さんに楽しんでもらえる何かをご用意できればと思っております😃 ,
  • RT : Going to Live Austin but need a guide on what to do and see while there? Here is your guide on bats, breakfast, and BBQ! and be sure to drop by the kiosk @mysql_community,
Locations of visitors to this page
categories